{"text_format":"1","workbook":"xlsx","n_sheets":3,"sheets":["Base de datos","Plantilla","El Tío Tech"],"not_rendered":{"charts":0,"images":2,"macros":0,"external_links":0,"defined_names":0,"comments":0,"pivot_tables":0},"unopened":[],"bounds":{"document_bytes":16777216,"sheet_cells":100000,"rows_first":2000,"rows_last":500,"rows_between":2000,"halvings":0,"cell_chars":16384,"cell_head_chars":4096},"cells_cut":0,"cells_raw":0,"read":"whole","date_system":"1900"}

{"sheet":"Base de datos","index":0,"n_rows":11,"n_cols":7,"rows_kept":11,"cut":false,"hidden":false,"merged":[]}
[]
[null,"Código","Nombre","Apellido","Edad","Sexo","Cargo"]
[null,"Emp_001","Miguel","Gimenes",25,"Hombre","Administrador"]
[null,"Emp_002","Juan","Sanchez",28,"Hombre","Contador"]
[null,"Emp_003","Carlos","Peres",24,"Hombre","Contador"]
[null,"Emp_004","María","Vela",23,"Mujer","Administrador"]
[null,"Emp_005","Mercedes","Iberico",35,"Mujer","Ing. Sistemas"]
[null,"Emp_006","Julia","Tenazoa",31,"Mujer","Ing. Sistemas"]
[null,"Emp_007","Liz","Toledo",25,"Mujer","Ing. Sistemas"]
[null,"Emp_008","Marcia","Garcia",26,"Mujer","Administrador"]
[null,"Emp_009","Manuel","Barbarán",30,"Hombre","Contador"]

{"sheet":"Plantilla","index":1,"n_rows":10,"n_cols":6,"rows_kept":10,"cut":false,"hidden":false,"merged":[[0,0,1,8]]}
["DATOS DE LOS EMPLEADOS"]
[]
[null,null,null,null,{"$f":"D4&\".jpg\"","v":"Emp_002.jpg"}]
[null,null,"Codigo","Emp_002","Cargo",{"$f":"VLOOKUP(D4,#REF!,6,FALSE)","v":{"$error":"#REF!"}}]
[]
[null,null,"Nombre",{"$f":"VLOOKUP(D4,#REF!,2,FALSE)","v":{"$error":"#REF!"}}]
[]
[null,null,"Apellido",{"$f":"VLOOKUP(D4,#REF!,3,FALSE)","v":{"$error":"#REF!"}}]
[]
[null,null,"Edad",{"$f":"VLOOKUP(D4,#REF!,4,FALSE)","v":{"$error":"#REF!"}}]

{"sheet":"El Tío Tech","index":2,"n_rows":12,"n_cols":3,"rows_kept":12,"cut":false,"hidden":false,"merged":[[11,1,12,5]]}
[null,"Base de Datos con Imágenes en Excel"]
["Tutoriales de El Tío Tech"]
[]
[]
[]
[null,"Aprende más sobre bases de datos en:","https://eltiotech.com/base-de-datos-en-excel/"]
[null,"Suscríbete a El Tío Tech en YouTube:","https://www.youtube.com/eltiotech"]
[null,"Visita la web para ver más tutoriales:","https://bit.ly/2BX3RdM"]
[null,"🔴 Cursos gratis de Excel:","https://eltiotech.com/cursos-gratis-de-excel-basico-intermedio-avanzado/"]
[]
[]
[null,"© Todos el contenido de este curso está sujeto a derechos de propiedad por las leyes de Derechos de Autor y demás Leyes relativas Internacionales por Miguel Vela - \"El Tío Tech\"."]